Reaction Details
Target5-hydroxytryptamine receptor 1A
LigandBDBM50036918
Substrate/Competitorn/a
Meas. Tech.ChEMBL_845 (CHEMBL615901)
IC50 0.19±n/a nM
Citation Norman, MHMinick, DJRigdon, GC Effect of linking bridge modifications on the antipsychotic profile of some phthalimide and isoindolinone derivatives. J Med Chem39:149-57 (1996) 
 
5-hydroxytryptamine receptor 1A
Name:5-hydroxytryptamine receptor 1A
Type:G Protein-Coupled Receptor (GPCR)
Mol. Mass.:46445.29
Organism:Rattus norvegicus (rat)
Description:Binding assays were performed using rat hippocampal membranes.
Residue:422
BDBM50036918
NameBDBM50036918
Synonyms:2-[4-(4-Benzo[d]isothiazol-3-yl-piperazin-1-yl)-butyl]-isoindole-1,3-dione | CHEMBL290937
TypeSmall organic molecule
Emp. Form.C23H24N4O2S
Mol. Mass.420.527
SMILESO=C1N(CCCCN2CCN(CC2)c2nsc3ccccc23)C(=O)c2ccccc12