Reaction Details
TargetGamma-aminobutyric acid receptor subunit alpha-1/beta-2/gamma-2
LigandBDBM50048828
Substrate/Competitorn/a
Meas. Tech.ChEMBL_70078 (CHEMBL677024)
Ki 0.300000±n/a nM
Citation Jacobsen, EJTenBrink, REStelzer, LSBelonga, KLCarter, DBIm, HKIm, WBSethy, VHTang, AHVonVoigtlander, PFPetke, JD High-affinity partial agonist imidazo[1,5-a]quinoxaline amides, carbamates, and ureas at the gamma-aminobutyric acid A/benzodiazepine receptor complex. J Med Chem39:158-75 (1996) 
 
Gamma-aminobutyric acid receptor subunit alpha-1/beta-2/gamma-2
Name:Gamma-aminobutyric acid receptor subunit alpha-1/beta-2/gamma-2
Type:Protein
Mol. Mass.:n/a
Description:n/a
Components:This complex has 3 components.
Component 1
Name:Gamma-aminobutyric acid receptor subunit alpha-1
Synonyms:Benzodiazepine central GABA A Benzodiazepine liver GABA(A) receptor subunit alpha-1 GABA-A receptor GBRA1_HUMAN TBPS | agonist GABA site
Type:Protein
Mol. Mass.:51817.35
Organism:Homo sapiens (Human)
Description:P14867
Residue:456
Component 2
Name:Gamma-aminobutyric acid receptor subunit beta-2
Synonyms:GABA(A) receptor subunit beta-2 GBRB2_HUMAN
Type:PROTEIN
Mol. Mass.:59167.91
Organism:Homo sapiens (Human)
Description:EBI_221
Residue:512
Component 3
Name:Gamma-aminobutyric acid receptor subunit gamma-2
Synonyms:GABA(A) receptor subunit gamma-2 GBRG2_HUMAN
Type:PROTEIN
Mol. Mass.:54172.74
Organism:Homo sapiens (Human)
Description:EBI_217
Residue:467
BDBM50048828
NameBDBM50048828
Synonyms:CHEMBL290036 | [3-(5-Cyclopropyl-[1,2,4]oxadiazol-3-yl)-7-fluoro-4H-imidazo[1,5-a]quinoxalin-5-yl]-morpholin-4-yl-methanone
TypeSmall organic molecule
Emp. Form.C20H19FN6O3
Mol. Mass.410.4017
SMILESFc1ccc-2c(c1)N(Cc1c(ncn-21)-c1noc(n1)C1CC1)C(=O)N1CCOCC1