Reaction Details
TargetGamma-aminobutyric acid receptor subunit alpha-3/beta-2/gamma-2
LigandBDBM50048855
Substrate/Competitorn/a
Meas. Tech.ChEMBL_70395 (CHEMBL683021)
Ki 3.5±n/a nM
Citation Jacobsen, EJTenBrink, REStelzer, LSBelonga, KLCarter, DBIm, HKIm, WBSethy, VHTang, AHVonVoigtlander, PFPetke, JD High-affinity partial agonist imidazo[1,5-a]quinoxaline amides, carbamates, and ureas at the gamma-aminobutyric acid A/benzodiazepine receptor complex. J Med Chem39:158-75 (1996) 
 
Gamma-aminobutyric acid receptor subunit alpha-3/beta-2/gamma-2
Name:Gamma-aminobutyric acid receptor subunit alpha-3/beta-2/gamma-2
Type:n/a
Mol. Mass.:n/a
Description:ASSAY_ID of EBI is 69791
Components:This complex has 3 components.
Component 1
Name:Gamma-aminobutyric acid receptor subunit gamma-2
Synonyms:GABA(A) receptor subunit gamma-2 GBRG2_HUMAN
Type:PROTEIN
Mol. Mass.:54172.74
Organism:Homo sapiens (Human)
Description:EBI_217
Residue:467
Component 2
Name:Gamma-aminobutyric acid receptor subunit beta-2
Synonyms:GABA(A) receptor subunit beta-2 GBRB2_HUMAN
Type:PROTEIN
Mol. Mass.:59167.91
Organism:Homo sapiens (Human)
Description:EBI_221
Residue:512
Component 3
Name:Gamma-aminobutyric acid receptor subunit alpha-3
Synonyms:GABA A Alpha3Beta3Gamma2 GABA C GABA-A receptor GBRA3_HUMAN agonist GABA site
Type:Enzyme Catalytic Domain
Mol. Mass.:55175.47
Organism:Homo sapiens (Human)
Description:GABA A Alpha3Beta1Gamma2 0 HUMAN::P34903
Residue:492
Component 4
Name:Gamma-aminobutyric acid receptor subunit beta-2
Synonyms:GABA(A) receptor subunit beta-2 GBRB2_HUMAN
Type:PROTEIN
Mol. Mass.:59167.91
Organism:Homo sapiens (Human)
Description:EBI_221
Residue:512
BDBM50048855
NameBDBM50048855
Synonyms:3-(5-Cyclopropyl-[1,2,4]oxadiazol-3-yl)-4H-imidazo[1,5-a]quinoxaline-5-carboxylic acid dimethylamide U-91571
TypeSmall organic molecule
Emp. Form.C18H18N6O2
Mol. Mass.350.3745
SMILESCN(C)C(=O)N1Cc2c(ncn2-c2ccccc12)-c1noc(n1)C1CC1