Reaction Details
TargetGamma-aminobutyric acid receptor subunit alpha-6/beta-2/gamma-2
LigandBDBM50048837
Substrate/Competitorn/a
Meas. Tech.ChEMBL_70711 (CHEMBL685347)
Ki 603±n/a nM
Citation Jacobsen, EJTenBrink, REStelzer, LSBelonga, KLCarter, DBIm, HKIm, WBSethy, VHTang, AHVonVoigtlander, PFPetke, JD High-affinity partial agonist imidazo[1,5-a]quinoxaline amides, carbamates, and ureas at the gamma-aminobutyric acid A/benzodiazepine receptor complex. J Med Chem39:158-75 (1996) 
 
Gamma-aminobutyric acid receptor subunit alpha-6/beta-2/gamma-2
Name:Gamma-aminobutyric acid receptor subunit alpha-6/beta-2/gamma-2
Type:n/a
Mol. Mass.:n/a
Description:ASSAY_ID of EBI is 30108
Components:This complex has 3 components.
Component 1
Name:Gamma-aminobutyric acid receptor subunit gamma-2
Synonyms:GABA(A) receptor subunit gamma-2 GBRG2_HUMAN
Type:PROTEIN
Mol. Mass.:54172.74
Organism:Homo sapiens (Human)
Description:EBI_217
Residue:467
Component 2
Name:Gamma-aminobutyric acid receptor subunit beta-2
Synonyms:GABA(A) receptor subunit beta-2 GBRB2_HUMAN
Type:PROTEIN
Mol. Mass.:59167.91
Organism:Homo sapiens (Human)
Description:EBI_221
Residue:512
Component 3
Name:Gamma-aminobutyric acid receptor subunit alpha-6
Synonyms:GABA A alpha6 GABRA6 | GBRA6_HUMAN
Type:Enzyme Catalytic Domain
Mol. Mass.:51029.60
Organism:Homo sapiens (Human)
Description:GABA A alpha6 0 HUMAN::Q16445
Residue:453
Component 4
Name:Gamma-aminobutyric acid receptor subunit beta-2
Synonyms:GABA(A) receptor subunit beta-2 GBRB2_HUMAN
Type:PROTEIN
Mol. Mass.:59167.91
Organism:Homo sapiens (Human)
Description:EBI_221
Residue:512
BDBM50048837
NameBDBM50048837
Synonyms:3-(5-Cyclopropyl-[1,2,4]oxadiazol-3-yl)-5-isopropyl-5H-imidazo[1,5-a]quinoxalin-4-one Panadiplon | U-78875
TypeSmall organic molecule
Emp. Form.C18H17N5O2
Mol. Mass.335.3599
SMILESCC(C)n1c2ccccc2n2cnc(-c3noc(n3)C3CC3)c2c1=O