Reaction Details
TargetDNA topoisomerase 1
LigandBDBM50049298
Substrate/Competitorn/a
Meas. Tech.ChEMBL_53714 (CHEMBL663642)
IC50 200±n/a nM
Citation Lackey, KSternbach, DDCroom, DKEmerson, DLEvans, MGLeitner, PLLuzzio, MJMcIntyre, GVuong, AYates, JBesterman, JM Water soluble inhibitors of topoisomerase I: quaternary salt derivatives of camptothecin. J Med Chem39:713-9 (1996) 
 
DNA topoisomerase 1
Name:DNA topoisomerase 1
Type:Enzyme
Mol. Mass.:90771.02
Organism:Homo sapiens (Human)
Description:P11387
Residue:765
BDBM50049298
NameBDBM50049298
Synonyms:7-ethyl-7-hydroxy-14-(1H-imidazol-3-ium-3-ylmethyl)-(7S)-7,8,11,13-tetrahydro-10H-[1,3]dioxolo[5,4-g]pyrano[3',4':6,7]indolizino[1,2-b]quinoline-8,11-dione | CHEMBL163007
TypeSmall organic molecule
Emp. Form.C26H22N4O6
Mol. Mass.486.4761
SMILESCC[C@@]1(O)C(=O)OCc2c1cc1-c3nc4cc5OCCOc5cc4c(Cn4ccnc4)c3Cn1c2=O