Reaction Details
TargetDelta-type opioid receptor
LigandBDBM50049379
Substrate/Competitorn/a
Meas. Tech.ChEMBL_147059 (CHEMBL754879)
Ki 2.48±n/a nM
Citation Breveglieri, AGuerrini, RSalvadori, SBianchi, CBryant, SDAttila, MLazarus, LH Design and synthesis of 1-aminocycloalkane-1-carboxylic acid-substituted deltorphin analogues: unique delta and mu opioid activity in modified peptides. J Med Chem39:773-80 (1996) 
 
Delta-type opioid receptor
Name:Delta-type opioid receptor
Type:G Protein-Coupled Receptor (GPCR)
Mol. Mass.:40465.04
Organism:Rattus norvegicus (rat)
Description:Competition binding assays were using CHO-K1 cell membranes expressing the opioid receptor.
Residue:372
BDBM50049379
NameBDBM50049379
Synonyms:(S)-3-[(S)-2-({1-[(S)-2-Amino-3-(4-hydroxy-phenyl)-propionylamino]-cyclohexanecarbonyl}-amino)-3-phenyl-propionylamino]-N-{(S)-1-[(S)-1-(carbamoylmethyl-carbamoyl)-2-methyl-propylcarbamoyl]-2-methyl-propyl}-succinamic acid | CHEMBL165263
TypeSmall organic molecule
Emp. Form.C41H58N8O10
Mol. Mass.822.9468
SMILESCC(C)[C@H](NC(=O)[C@@H](NC(=O)[C@H](CC(O)=O)NC(=O)[C@H](Cc1ccccc1)NC(=O)C1(CCCCC1)NC(=O)[C@@H](N)Cc1ccc(O)cc1)C(C)C)C(=O)NCC(N)=O