Reaction Details
TargetDelta-type opioid receptor
LigandBDBM50049378
Substrate/Competitorn/a
Meas. Tech.ChEMBL_147059 (CHEMBL754879)
Ki 0.045±n/a nM
Citation Breveglieri, AGuerrini, RSalvadori, SBianchi, CBryant, SDAttila, MLazarus, LH Design and synthesis of 1-aminocycloalkane-1-carboxylic acid-substituted deltorphin analogues: unique delta and mu opioid activity in modified peptides. J Med Chem39:773-80 (1996) 
 
Delta-type opioid receptor
Name:Delta-type opioid receptor
Type:G Protein-Coupled Receptor (GPCR)
Mol. Mass.:40465.04
Organism:Rattus norvegicus (rat)
Description:Competition binding assays were using CHO-K1 cell membranes expressing the opioid receptor.
Residue:372
BDBM50049378
NameBDBM50049378
Synonyms:1-((S)-2-{(S)-2-[(S)-2-Amino-3-(4-hydroxy-phenyl)-propionylamino]-propionylamino}-3-phenyl-propionylamino)-cyclohexanecarboxylic acid {(S)-1-[(S)-1-(carbamoylmethyl-carbamoyl)-2-methyl-propylcarbamoyl]-2-methyl-propyl}-amide | CHEMBL405102
TypeSmall organic molecule
Emp. Form.C40H58N8O8
Mol. Mass.778.9373
SMILESCC(C)[C@H](NC(=O)[C@@H](NC(=O)C1(CCCCC1)NC(=O)[C@H](Cc1ccccc1)NC(=O)[C@H](C)NC(=O)[C@@H](N)Cc1ccc(O)cc1)C(C)C)C(=O)NCC(N)=O