Reaction Details
TargetAdenosine receptor A1
LigandBDBM7460
Substrate/Competitorn/a
Meas. Tech.ChEMBL_29486 (CHEMBL641720)
Ki 2470±n/a nM
Citation Ji, XDMelman, NJacobson, KA Interactions of flavonoids and other phytochemicals with adenosine receptors. J Med Chem39:781-8 (1996) 
 
Adenosine receptor A1
Name:Adenosine receptor A1
Type:Protein
Mol. Mass.:36704.13
Organism:Rattus norvegicus (rat)
Description:n/a
Residue:326
BDBM7460
NameBDBM7460
Synonyms:2-(3,4-dihydroxyphenyl)-3,5,7-trihydroxy-4H-chromen-4-one 2-(3,4-dihydroxyphenyl)-3,5,7-trihydroxy-chromone;hydrate Quercetin Quercetin (21) US11021454, Compound Quercetin med.21724, Compound 4
TypeSmall organic molecule
Emp. Form.C15H10O7
Mol. Mass.302.2357
SMILESOc1cc(O)c2c(c1)oc(-c1ccc(O)c(O)c1)c(O)c2=O