Reaction Details
TargetAcetylcholinesterase
LigandBDBM50500452
Substrate/Competitorn/a
Meas. Tech.ChEMBL_1547055 (CHEMBL3748158)
IC50 910±n/a nM
Citation Shaik, JBPalaka, BKPenumala, MKotapati, KVDevineni, SREadlapalli, SDarla, MMAmpasala, DRVadde, RAmooru, GD Synthesis, pharmacological assessment, molecular modeling and in silico studies of fused tricyclic coumarin derivatives as a new family of multifunctional anti-Alzheimer agents. Eur J Med Chem107:219-32 (2016) 
 
Acetylcholinesterase
Name:Acetylcholinesterase
Type:Enzyme
Mol. Mass.:71812.79
Organism:Electrophorus electricus (Electric eel)
Description:n/a
Residue:633
BDBM50500452
NameBDBM50500452
Synonyms:CHEMBL3746215
TypeSmall organic molecule
Emp. Form.C17H14N2O4
Mol. Mass.310.3041
SMILESCc1cc(=O)oc2c1ccc1oc(=N)c(cc21)C(=O)NC1CC1