Reaction Details
TargetAcetylcholinesterase
LigandBDBM50500457
Substrate/Competitorn/a
Meas. Tech.ChEMBL_1547055 (CHEMBL3748158)
IC50 3.0±n/a nM
Citation Shaik, JBPalaka, BKPenumala, MKotapati, KVDevineni, SREadlapalli, SDarla, MMAmpasala, DRVadde, RAmooru, GD Synthesis, pharmacological assessment, molecular modeling and in silico studies of fused tricyclic coumarin derivatives as a new family of multifunctional anti-Alzheimer agents. Eur J Med Chem107:219-32 (2016) 
 
Acetylcholinesterase
Name:Acetylcholinesterase
Type:Enzyme
Mol. Mass.:71812.79
Organism:Electrophorus electricus (Electric eel)
Description:n/a
Residue:633
BDBM50500457
NameBDBM50500457
Synonyms:CHEMBL3746815
TypeSmall organic molecule
Emp. Form.C21H15BrN2O4
Mol. Mass.439.259
SMILESCc1cc(=O)oc2c1ccc1oc(=N)c(cc21)C(=O)NCc1cccc(Br)c1