Reaction Details
TargetAcetylcholinesterase
LigandBDBM50500467
Substrate/Competitorn/a
Meas. Tech.ChEMBL_1547055 (CHEMBL3748158)
IC50 12±n/a nM
Citation Shaik, JBPalaka, BKPenumala, MKotapati, KVDevineni, SREadlapalli, SDarla, MMAmpasala, DRVadde, RAmooru, GD Synthesis, pharmacological assessment, molecular modeling and in silico studies of fused tricyclic coumarin derivatives as a new family of multifunctional anti-Alzheimer agents. Eur J Med Chem107:219-32 (2016) 
 
Acetylcholinesterase
Name:Acetylcholinesterase
Type:Enzyme
Mol. Mass.:71812.79
Organism:Electrophorus electricus (Electric eel)
Description:n/a
Residue:633
BDBM50500467
NameBDBM50500467
Synonyms:CHEMBL3745757
TypeSmall organic molecule
Emp. Form.C21H15ClN2O4
Mol. Mass.394.808
SMILESCc1cc(=O)oc2c1ccc1oc(=N)c(cc21)C(=O)NCc1ccccc1Cl