Reaction Details
TargetAcetylcholinesterase
LigandBDBM50500466
Substrate/Competitorn/a
Meas. Tech.ChEMBL_1547055 (CHEMBL3748158)
IC50 226±n/a nM
Citation Shaik, JBPalaka, BKPenumala, MKotapati, KVDevineni, SREadlapalli, SDarla, MMAmpasala, DRVadde, RAmooru, GD Synthesis, pharmacological assessment, molecular modeling and in silico studies of fused tricyclic coumarin derivatives as a new family of multifunctional anti-Alzheimer agents. Eur J Med Chem107:219-32 (2016) 
 
Acetylcholinesterase
Name:Acetylcholinesterase
Type:Enzyme
Mol. Mass.:71812.79
Organism:Electrophorus electricus (Electric eel)
Description:n/a
Residue:633
BDBM50500466
NameBDBM50500466
Synonyms:CHEMBL3747027
TypeSmall organic molecule
Emp. Form.C20H13N3O6
Mol. Mass.391.3337
SMILESCc1cc(=O)oc2c1ccc1oc(=N)c(cc21)C(=O)Nc1ccccc1[N+]([O-])=O