Reaction Details
TargetDiacylglycerol lipase-alpha
LigandBDBM50350547
Substrate/Competitorn/a
Meas. Tech.ChEMBL_1547769 (CHEMBL3756328)
IC50 31±n/a nM
Citation Janssen, FJBaggelaar, MPHummel, JJOverkleeft, HSCravatt, BFBoger, DLvan der Stelt, M Comprehensive Analysis of Structure-Activity Relationships of ?-Ketoheterocycles as sn-1-Diacylglycerol Lipase ? Inhibitors. J Med Chem58:9742-53 (2015) 
 
Diacylglycerol lipase-alpha
Name:Diacylglycerol lipase-alpha
Type:PROTEIN
Mol. Mass.:114947.74
Organism:Homo sapiens (Human)
Description:ChEMBL_1449471
Residue:1042
BDBM50350547
NameBDBM50350547
Synonyms:CHEMBL257307
TypeSmall organic molecule
Emp. Form.C18H26N2O2
Mol. Mass.302.4112
SMILESCCCCCCCCCCCC(=O)c1nc2ncccc2o1