Reaction Details
TargetD(4) dopamine receptor
LigandBDBM50050462
Substrate/Competitorn/a
Meas. Tech.ChEMBL_60678 (CHEMBL674049)
Ki 1.6±n/a nM
Citation Kulagowski, JJBroughton, HBCurtis, NRMawer, IMRidgill, MPBaker, REmms, FFreedman, SBMarwood, RPatel, SPatel, SRagan, CILeeson, PD 3-((4-(4-Chlorophenyl)piperazin-1-yl)-methyl)-1H-pyrrolo-2,3-b-pyridine: an antagonist with high affinity and selectivity for the human dopamine D4 receptor. J Med Chem39:1941-2 (1996) 
 
D(4) dopamine receptor
Name:D(4) dopamine receptor
Type:Enzyme
Mol. Mass.:48373.19
Organism:Homo sapiens (Human)
Description:P21917
Residue:419
BDBM50050462
NameBDBM50050462
Synonyms:3-[4-(4-Chloro-phenyl)-piperazin-1-ylmethyl]-1H-indole | CHEMBL268799
TypeSmall organic molecule
Emp. Form.C19H20ClN3
Mol. Mass.325.835
SMILESClc1ccc(cc1)N1CCN(Cc2c[nH]c3ccccc23)CC1