Reaction Details
TargetD(4) dopamine receptor
LigandBDBM50050475
Substrate/Competitorn/a
Meas. Tech.ChEMBL_63104 (CHEMBL674497)
Ki 3.6±n/a nM
Citation Rowley, MBroughton, HBCollins, IBaker, REmms, FMarwood, RPatel, SPatel, SRagan, CIFreedman, SBLeeson, PD 5-(4-Chlorophenyl)-4-methyl-3-(1-(2-phenylethyl)piperidin-4-yl)isoxazole: a potent, selective antagonist at human cloned dopamine D4 receptors. J Med Chem39:1943-5 (1996) 
 
D(4) dopamine receptor
Name:D(4) dopamine receptor
Type:Enzyme
Mol. Mass.:48373.19
Organism:Homo sapiens (Human)
Description:P21917
Residue:419
BDBM50050475
NameBDBM50050475
Synonyms:1-(4-Chloro-benzyl)-4-[3-(4-chloro-phenyl)-isoxazol-5-yl]-piperidine | CHEMBL61195
TypeSmall organic molecule
Emp. Form.C21H20Cl2N2O
Mol. Mass.387.302
SMILESClc1ccc(CN2CCC(CC2)c2cc(no2)-c2ccc(Cl)cc2)cc1