Reaction Details
TargetAlpha-1D adrenergic receptor
LigandBDBM50453799
Substrate/Competitorn/a
Meas. Tech.ChEMBL_32723 (CHEMBL645995)
Ki 82±n/a nM
Citation Quaglia, WPigini, MTayebati, SKPiergentili, AGiannella, MLeonardi, ATaddei, CMelchiorre, C Synthesis, absolute configuration, and biological profile of the enantiomers of trans-[2-(2,6-dimethoxyphenoxy)ethyl] [(3-p-tolyl-2,3-dihydro-1,4-benzodioxin-2-yl)methyl]amine (mephendioxan), a potent competitive alpha 1A-adrenoreceptor antagonist. J Med Chem39:2253-8 (1996) 
 
Alpha-1D adrenergic receptor
Name:Alpha-1D adrenergic receptor
Type:Protein
Mol. Mass.:59375.97
Organism:Rattus norvegicus (Rat)
Description:P23944
Residue:561
BDBM50453799
NameBDBM50453799
Synonyms:Niguldipine
TypeSmall organic molecule
Emp. Form.C36H39N3O6
Mol. Mass.609.7114
SMILESCOC(=O)C1=C(C)NC(C)=C([C@H]1c1cccc(c1)[N+]([O-])=O)C(=O)OCCCN1CCC(CC1)(c1ccccc1)c1ccccc1