Reaction Details
TargetNeutrophil elastase
LigandBDBM50051143
Substrate/Competitorn/a
Meas. Tech.ChEMBL_63975 (CHEMBL677601)
Ki 8.4±n/a nM
Citation Edwards, PDAndisik, DWStrimpler, AMGomes, BTuthill, PA Nonpeptidic inhibitors of human neutrophil elastase. 7. Design, synthesis, and in vitro activity of a series of pyridopyrimidine trifluoromethyl ketones. J Med Chem39:1112-24 (1996) 
 
Neutrophil elastase
Name:Neutrophil elastase
Type:Enzyme
Mol. Mass.:28532.38
Organism:Homo sapiens (Human)
Description:P08246
Residue:267
BDBM50051143
NameBDBM50051143
Synonyms:2-[(R)-3-(2-Morpholin-4-yl-ethyl)-2,4,8-trioxo-6-phenyl-2,3,4,8-tetrahydro-1H-pyrido[3,4-d]pyrimidin-7-yl]-N-(3,3,3-trifluoro-1-isopropyl-2-oxo-propyl)-acetamide | CHEMBL14293
TypeSmall organic molecule
Emp. Form.C27H30F3N5O6
Mol. Mass.577.5522
SMILESCC(C)C(NC(=O)Cn1c(cc2c([nH]c(=O)n(CCN3CCOCC3)c2=O)c1=O)-c1ccccc1)C(=O)C(F)(F)F