Reaction Details
TargetNeutrophil elastase
LigandBDBM50051151
Substrate/Competitorn/a
Meas. Tech.ChEMBL_63975 (CHEMBL677601)
Ki 690±n/a nM
Citation Edwards, PDAndisik, DWStrimpler, AMGomes, BTuthill, PA Nonpeptidic inhibitors of human neutrophil elastase. 7. Design, synthesis, and in vitro activity of a series of pyridopyrimidine trifluoromethyl ketones. J Med Chem39:1112-24 (1996) 
 
Neutrophil elastase
Name:Neutrophil elastase
Type:Enzyme
Mol. Mass.:28532.38
Organism:Homo sapiens (Human)
Description:P08246
Residue:267
BDBM50051151
NameBDBM50051151
Synonyms:CHEMBL273612 | {(R)-2,4,8-Trioxo-7-[(3,3,3-trifluoro-1-isopropyl-2-oxo-propylcarbamoyl)-methyl]-1,4,7,8-tetrahydro-2H-pyrido[3,4-d]pyrimidin-3-yl}-acetic acid
TypeSmall organic molecule
Emp. Form.C17H17F3N4O7
Mol. Mass.446.3347
SMILESCC(C)C(NC(=O)Cn1ccc2c([nH]c(=O)n(CC(O)=O)c2=O)c1=O)C(=O)C(F)(F)F