Reaction Details
TargetNeutrophil elastase
LigandBDBM50037357
Substrate/Competitorn/a
Meas. Tech.ChEMBL_63975 (CHEMBL677601)
Ki 469.0±n/a nM
Citation Edwards, PDAndisik, DWStrimpler, AMGomes, BTuthill, PA Nonpeptidic inhibitors of human neutrophil elastase. 7. Design, synthesis, and in vitro activity of a series of pyridopyrimidine trifluoromethyl ketones. J Med Chem39:1112-24 (1996) 
 
Neutrophil elastase
Name:Neutrophil elastase
Type:Enzyme
Mol. Mass.:28532.38
Organism:Homo sapiens (Human)
Description:P08246
Residue:267
BDBM50037357
NameBDBM50037357
Synonyms:2-[3-((S)-2-Morpholin-4-yl-acetylamino)-2-oxo-6-phenyl-2H-pyridin-1-yl]-N-(3,3,3-trifluoro-1-isopropyl-2-oxo-propyl)-acetamide CHEMBL14516
TypeSmall organic molecule
Emp. Form.C25H29F3N4O5
Mol. Mass.522.5168
SMILESCC(C)C(NC(=O)Cn1c(ccc(NC(=O)CN2CCOCC2)c1=O)-c1ccccc1)C(=O)C(F)(F)F