Reaction Details
TargetNeutrophil elastase
LigandBDBM50051161
Substrate/Competitorn/a
Meas. Tech.ChEMBL_63975 (CHEMBL677601)
Ki 230±n/a nM
Citation Edwards, PDAndisik, DWStrimpler, AMGomes, BTuthill, PA Nonpeptidic inhibitors of human neutrophil elastase. 7. Design, synthesis, and in vitro activity of a series of pyridopyrimidine trifluoromethyl ketones. J Med Chem39:1112-24 (1996) 
 
Neutrophil elastase
Name:Neutrophil elastase
Type:Enzyme
Mol. Mass.:28532.38
Organism:Homo sapiens (Human)
Description:P08246
Residue:267
BDBM50051161
NameBDBM50051161
Synonyms:CHEMBL276181 | N-(3,3,3-Trifluoro-1-isopropyl-2-oxo-propyl)-2-[(R)-2,4,8-trioxo-3-((1S,2R)-2-phenyl-cyclopropyl)-2,3,4,8-tetrahydro-1H-pyrido[3,4-d]pyrimidin-7-yl]-acetamide
TypeSmall organic molecule
Emp. Form.C24H23F3N4O5
Mol. Mass.504.4584
SMILESCC(C)C(NC(=O)Cn1ccc2c([nH]c(=O)n([C@H]3C[C@@H]3c3ccccc3)c2=O)c1=O)C(=O)C(F)(F)F