Reaction Details
TargetAdenosine receptor A2a
LigandBDBM50094688
Substrate/Competitorn/a
Meas. Tech.ChEMBL_31063 (CHEMBL641347)
Ki 1.9±n/a nM
Citation Baraldi, PGCacciari, BSpalluto, GPineda de las Infantas y Villatoro, MJZocchi, CDionisotti, SOngini, E Pyrazolo[4,3-e]-1,2,4-triazolo[1,5-c]pyrimidine derivatives: potent and selective A(2A) adenosine antagonists. J Med Chem39:1164-71 (1996) 
 
Adenosine receptor A2a
Name:Adenosine receptor A2a
Type:G Protein-Coupled Receptor (GPCR)
Mol. Mass.:45015.65
Organism:Rattus norvegicus (rat)
Description:Rat A2A receptors expressed in CHO cells.
Residue:410
BDBM50094688
NameBDBM50094688
Synonyms:2-(furan-2-yl)-8-isopentyl-8H-pyrazolo[4,3-e][1,2,4]triazolo[1,5-c]pyrimidin-5-amine CHEMBL315150
TypeSmall organic molecule
Emp. Form.C15H17N7O
Mol. Mass.311.3418
SMILESCC(C)CCn1cc2c(n1)nc(N)n1nc(nc21)-c1ccco1