Reaction Details
TargetAdenosine receptor A1
LigandBDBM50051232
Substrate/Competitorn/a
Meas. Tech.ChEMBL_29479 (CHEMBL640472)
Ki 3.3±n/a nM
Citation Baraldi, PGCacciari, BSpalluto, GPineda de las Infantas y Villatoro, MJZocchi, CDionisotti, SOngini, E Pyrazolo[4,3-e]-1,2,4-triazolo[1,5-c]pyrimidine derivatives: potent and selective A(2A) adenosine antagonists. J Med Chem39:1164-71 (1996) 
 
Adenosine receptor A1
Name:Adenosine receptor A1
Type:Protein
Mol. Mass.:36704.13
Organism:Rattus norvegicus (rat)
Description:n/a
Residue:326
BDBM50051232
NameBDBM50051232
Synonyms:8-(4-Fluoro-benzyl)-2-furan-2-yl-8H-pyrazolo[4,3-e][1,2,4]triazolo[1,5-c]pyrimidin-5-ylamine | CHEMBL278906
TypeSmall organic molecule
Emp. Form.C17H12FN7O
Mol. Mass.349.3219
SMILESNc1nc2nn(Cc3ccc(F)cc3)cc2c2nc(nn12)-c1ccco1