Reaction Details
TargetAdenosine receptor A1
LigandBDBM50051340
Substrate/Competitorn/a
Meas. Tech.ChEMBL_29152 (CHEMBL639432)
Ki 2640±n/a nM
Citation Karton, YJiang, JLJi, XDMelman, NOlah, MEStiles, GLJacobson, KA Synthesis and biological activities of flavonoid derivatives as A3 adenosine receptor antagonists. J Med Chem39:2293-301 (1996) 
 
Adenosine receptor A1
Name:Adenosine receptor A1
Type:Protein
Mol. Mass.:36704.13
Organism:Rattus norvegicus (rat)
Description:n/a
Residue:326
BDBM50051340
NameBDBM50051340
Synonyms:2'-Hydroxyflavanone 2-(2-Hydroxy-phenyl)-chroman-4-one CHEMBL75897
TypeSmall organic molecule
Emp. Form.C15H12O3
Mol. Mass.240.254
SMILESOc1ccccc1C1CC(=O)c2ccccc2O1