Reaction Details
TargetRyanodine receptor 1
LigandBDBM50051434
Substrate/Competitorn/a
Meas. Tech.ChEMBL_196055 (CHEMBL803054)
Ki 1.8±n/a nM
Citation Jefferies, PRBlumenkopf, TAGengo, PJCole, LCCasida, JE Ryanodine action at calcium release channels. 1. importance of hydroxyl substituents. J Med Chem39:2331-8 (1996) 
 
Ryanodine receptor 1
Name:Ryanodine receptor 1
Type:PROTEIN
Mol. Mass.:565027.60
Organism:Homo sapiens (Human)
Description:ChEMBL_196055
Residue:5038
BDBM50051434
NameBDBM50051434
Synonyms:10-epi-hydroxy-Ryanodine Ryanodine Derivative
TypeSmall organic molecule
Emp. Form.C25H35NO9
Mol. Mass.493.5467
SMILESCC(C)C1(O)C(OC(=O)c2ccc[nH]2)C2(O)C3(C)CC4(O)OC5(C(O)C(C)CCC35O)C2(O)C14C