Reaction Details
TargetRetinoic acid receptor alpha
LigandBDBM31882
Substrate/Competitorn/a
Meas. Tech.ChEMBL_197404 (CHEMBL799794)
Kd 7500±n/a nM
Citation Yu, KLSpinazze, POstrowski, JCurrier, SJPack, EJHammer, LRoalsvig, THoneyman, JATortolani, DRReczek, PRMansuri, MMStarrett, JE Retinoic acid receptor beta,gamma-selective ligands: synthesis and biological activity of 6-substituted 2-naphthoic acid retinoids. J Med Chem39:2411-21 (1996) 
 
Retinoic acid receptor alpha
Name:Retinoic acid receptor alpha
Type:PROTEIN
Mol. Mass.:50778.87
Organism:Homo sapiens (Human)
Description:ChEMBL_1466191
Residue:462
BDBM31882
NameBDBM31882
Synonyms:BMS184394-R | CHEMBL80992
TypeSmall organic molecule
Emp. Form.C26H28O3
Mol. Mass.388.4987
SMILESCC1(C)CCC(C)(C)c2cc(ccc12)[C@H](O)c1ccc2cc(ccc2c1)C(O)=O