Reaction Details
TargetD(2) dopamine receptor
LigandBDBM50026847
Substrate/Competitorn/a
Meas. Tech.ChEMBL_62235 (CHEMBL675746)
Ki 400±n/a nM
Citation TenBrink, REBergh, CLDuncan, JNHarris, DWHuff, RMLahti, RALawson, CFLutzke, BSMartin, IJRees, SASchlachter, SKSih, JCSmith, MW (S)-(-)-4-[4-[2-(isochroman-1-yl)ethyl]-piperazin-1-yl] benzenesulfonamide, a selective dopamine D4 antagonist. J Med Chem39:2435-7 (1996) 
 
D(2) dopamine receptor
Name:D(2) dopamine receptor
Type:G Protein-Coupled Receptor (GPCR)
Mol. Mass.:50931.60
Organism:Rattus norvegicus (rat)
Description:P61169
Residue:444
BDBM50026847
NameBDBM50026847
Synonyms:1-[2-(6,7-Dimethoxy-isochroman-1-yl)-ethyl]-4-(4-fluoro-phenyl)-piperazine | CHEMBL83915
TypeSmall organic molecule
Emp. Form.C23H29FN2O3
Mol. Mass.400.4864
SMILESCOc1cc2CCOC(CCN3CCN(CC3)c3ccc(F)cc3)c2cc1OC