Reaction Details
TargetTranslocator protein
LigandBDBM50045877
Substrate/Competitorn/a
Meas. Tech.ChEMBL_39445 (CHEMBL653021)
IC50 10±n/a nM
Citation TenBrink, REBergh, CLDuncan, JNHarris, DWHuff, RMLahti, RALawson, CFLutzke, BSMartin, IJRees, SASchlachter, SKSih, JCSmith, MW (S)-(-)-4-[4-[2-(isochroman-1-yl)ethyl]-piperazin-1-yl] benzenesulfonamide, a selective dopamine D4 antagonist. J Med Chem39:2435-7 (1996) 
 
Translocator protein
Name:Translocator protein
Type:Mitochondrion membrane protein
Mol. Mass.:18945.84
Organism:Rattus norvegicus (rat)
Description:Competitive binding experiments were performed on rat kidney mitochondrial membranes.
Residue:169
BDBM50045877
NameBDBM50045877
Synonyms:2-(2-(4-fluorophenyl)-1H-indol-3-yl)-N,N-dihexylacetamide CHEMBL63154 | [N,N-di-n-hexyl-2-(4-fluorophenyl) indole-3-acetamide]
TypeSmall organic molecule
Emp. Form.C28H37FN2O
Mol. Mass.436.6046
SMILESCCCCCCN(CCCCCC)C(=O)Cc1c([nH]c2ccccc12)-c1ccc(F)cc1