Reaction Details
TargetD(1A) dopamine receptor
LigandBDBM50040245
Substrate/Competitorn/a
Meas. Tech.ChEMBL_58523 (CHEMBL872493)
Ki 398±n/a nM
Citation TenBrink, REBergh, CLDuncan, JNHarris, DWHuff, RMLahti, RALawson, CFLutzke, BSMartin, IJRees, SASchlachter, SKSih, JCSmith, MW (S)-(-)-4-[4-[2-(isochroman-1-yl)ethyl]-piperazin-1-yl] benzenesulfonamide, a selective dopamine D4 antagonist. J Med Chem39:2435-7 (1996) 
 
D(1A) dopamine receptor
Name:D(1A) dopamine receptor
Type:Enzyme Catalytic Domain
Mol. Mass.:49429.75
Organism:RAT
Description:P18901
Residue:446
BDBM50040245
NameBDBM50040245
Synonyms:8-Methyl-6-(4-methyl-piperazin-1-yl)-11H-benzo[e]pyrido[3,2-b][1,4]diazepine | CHEMBL63329
TypeSmall organic molecule
Emp. Form.C18H21N5
Mol. Mass.307.3928
SMILESCN1CCN(CC1)C1=Nc2cccnc2Nc2ccc(C)cc12