Reaction Details
Target5-hydroxytryptamine receptor 1A
LigandBDBM85067
Substrate/Competitorn/a
Meas. Tech.ChEMBL_1096 (CHEMBL616419)
Ki 120±n/a nM
Citation TenBrink, REBergh, CLDuncan, JNHarris, DWHuff, RMLahti, RALawson, CFLutzke, BSMartin, IJRees, SASchlachter, SKSih, JCSmith, MW (S)-(-)-4-[4-[2-(isochroman-1-yl)ethyl]-piperazin-1-yl] benzenesulfonamide, a selective dopamine D4 antagonist. J Med Chem39:2435-7 (1996) 
 
5-hydroxytryptamine receptor 1A
Name:5-hydroxytryptamine receptor 1A
Type:G Protein-Coupled Receptor (GPCR)
Mol. Mass.:46445.29
Organism:Rattus norvegicus (rat)
Description:Binding assays were performed using rat hippocampal membranes.
Residue:422
BDBM85067
NameBDBM85067
Synonyms:CAS_170856-41-4 PNU 96415E | PNU-96415E
TypeSmall organic molecule
Emp. Form.C21H25FN2O
Mol. Mass.340.4344
SMILESFc1ccc(cc1)N1CCN(CCC2OCCc3ccccc23)CC1