Reaction Details
TargetD(2) dopamine receptor
LigandBDBM85067
Substrate/Competitorn/a
Meas. Tech.ChEMBL_62235 (CHEMBL675746)
Ki 160±n/a nM
Citation TenBrink, REBergh, CLDuncan, JNHarris, DWHuff, RMLahti, RALawson, CFLutzke, BSMartin, IJRees, SASchlachter, SKSih, JCSmith, MW (S)-(-)-4-[4-[2-(isochroman-1-yl)ethyl]-piperazin-1-yl] benzenesulfonamide, a selective dopamine D4 antagonist. J Med Chem39:2435-7 (1996) 
 
D(2) dopamine receptor
Name:D(2) dopamine receptor
Type:G Protein-Coupled Receptor (GPCR)
Mol. Mass.:50931.60
Organism:Rattus norvegicus (rat)
Description:P61169
Residue:444
BDBM85067
NameBDBM85067
Synonyms:CAS_170856-41-4 PNU 96415E | PNU-96415E
TypeSmall organic molecule
Emp. Form.C21H25FN2O
Mol. Mass.340.4344
SMILESFc1ccc(cc1)N1CCN(CCC2OCCc3ccccc23)CC1