Reaction Details
TargetD(3) dopamine receptor
LigandBDBM50001884
Substrate/Competitorn/a
Meas. Tech.ChEMBL_62755 (CHEMBL674595)
Ki 280±n/a nM
Citation TenBrink, REBergh, CLDuncan, JNHarris, DWHuff, RMLahti, RALawson, CFLutzke, BSMartin, IJRees, SASchlachter, SKSih, JCSmith, MW (S)-(-)-4-[4-[2-(isochroman-1-yl)ethyl]-piperazin-1-yl] benzenesulfonamide, a selective dopamine D4 antagonist. J Med Chem39:2435-7 (1996) 
 
D(3) dopamine receptor
Name:D(3) dopamine receptor
Type:Protein
Mol. Mass.:49540.58
Organism:Rattus norvegicus (Rat)
Description:P19020
Residue:446
BDBM50001884
NameBDBM50001884
Synonyms:2-[4-(4-Methyl-benzyl)-piperazin-1-yl]-1-(2-methyl-2,3-dihydro-indol-1-yl)-ethanone 3-chloro-6-(4-methyl-piperazin-1-yl)-5H-dibenzo[b,e][1,4]diazepine 8-Chloro-11-(4-methyl-piperazin-1-yl)-5H-dibenzo[b,e][1,4]diazepine( Clozepine ) 8-Chloro-11-(4-methyl-piperazin-1-yl)-5H-dibenzo[b,e][1,4]diazepine(Clopazine) 8-chloro-11-(4-methylpiperazin-1-yl)-5H-dibenzo[b,e][1,4]diazepine CHEMBL538973 CLOZAPINE, 8-CHLORO-11-(4-METHYL-PIPERAZIN-1-YL)-5H-DIBENZO[B,E][1,4]DIAZEPINE HF 1854 US10752588, Compound Clozapine | US11498896, Compound Clozapine
TypeSmall organic molecule
Emp. Form.C18H19ClN4
Mol. Mass.326.823
SMILESCN1CCN(CC1)C1=Nc2cc(Cl)ccc2Nc2ccccc12