Reaction Details
TargetD(1A) dopamine receptor
LigandBDBM85067
Substrate/Competitorn/a
Meas. Tech.ChEMBL_58523 (CHEMBL872493)
Ki 410±n/a nM
Citation TenBrink, REBergh, CLDuncan, JNHarris, DWHuff, RMLahti, RALawson, CFLutzke, BSMartin, IJRees, SASchlachter, SKSih, JCSmith, MW (S)-(-)-4-[4-[2-(isochroman-1-yl)ethyl]-piperazin-1-yl] benzenesulfonamide, a selective dopamine D4 antagonist. J Med Chem39:2435-7 (1996) 
 
D(1A) dopamine receptor
Name:D(1A) dopamine receptor
Type:Enzyme Catalytic Domain
Mol. Mass.:49429.75
Organism:RAT
Description:P18901
Residue:446
BDBM85067
NameBDBM85067
Synonyms:CAS_170856-41-4 PNU 96415E | PNU-96415E
TypeSmall organic molecule
Emp. Form.C21H25FN2O
Mol. Mass.340.4344
SMILESFc1ccc(cc1)N1CCN(CCC2OCCc3ccccc23)CC1