Reaction Details
TargetD(4) dopamine receptor
LigandBDBM50040245
Substrate/Competitorn/a
Meas. Tech.ChEMBL_60979 (CHEMBL671597)
Ki 21±n/a nM
Citation TenBrink, REBergh, CLDuncan, JNHarris, DWHuff, RMLahti, RALawson, CFLutzke, BSMartin, IJRees, SASchlachter, SKSih, JCSmith, MW (S)-(-)-4-[4-[2-(isochroman-1-yl)ethyl]-piperazin-1-yl] benzenesulfonamide, a selective dopamine D4 antagonist. J Med Chem39:2435-7 (1996) 
 
D(4) dopamine receptor
Name:D(4) dopamine receptor
Type:Enzyme Catalytic Domain
Mol. Mass.:41307.65
Organism:RAT
Description:DOPAMINE D4.4 0 RAT::P30729
Residue:387
BDBM50040245
NameBDBM50040245
Synonyms:8-Methyl-6-(4-methyl-piperazin-1-yl)-11H-benzo[e]pyrido[3,2-b][1,4]diazepine | CHEMBL63329
TypeSmall organic molecule
Emp. Form.C18H21N5
Mol. Mass.307.3928
SMILESCN1CCN(CC1)C1=Nc2cccnc2Nc2ccc(C)cc12