Reaction Details
TargetD(3) dopamine receptor
LigandBDBM50051564
Substrate/Competitorn/a
Meas. Tech.ChEMBL_62752 (CHEMBL674593)
Ki 220±n/a nM
Citation TenBrink, REBergh, CLDuncan, JNHarris, DWHuff, RMLahti, RALawson, CFLutzke, BSMartin, IJRees, SASchlachter, SKSih, JCSmith, MW (S)-(-)-4-[4-[2-(isochroman-1-yl)ethyl]-piperazin-1-yl] benzenesulfonamide, a selective dopamine D4 antagonist. J Med Chem39:2435-7 (1996) 
 
D(3) dopamine receptor
Name:D(3) dopamine receptor
Type:Protein
Mol. Mass.:49540.58
Organism:Rattus norvegicus (Rat)
Description:P19020
Residue:446
BDBM50051564
NameBDBM50051564
Synonyms:1-((R)-2-Isochroman-1-yl-ethyl)-4-(4-methoxy-phenyl)-piperazine | CHEMBL82591
TypeSmall organic molecule
Emp. Form.C22H28N2O2
Mol. Mass.352.4699
SMILESCOc1ccc(cc1)N1CCN(CC[C@H]2OCCc3ccccc23)CC1