Reaction Details
TargetD(4) dopamine receptor
LigandBDBM50051563
Substrate/Competitorn/a
Meas. Tech.ChEMBL_60979 (CHEMBL671597)
Ki 100±n/a nM
Citation TenBrink, REBergh, CLDuncan, JNHarris, DWHuff, RMLahti, RALawson, CFLutzke, BSMartin, IJRees, SASchlachter, SKSih, JCSmith, MW (S)-(-)-4-[4-[2-(isochroman-1-yl)ethyl]-piperazin-1-yl] benzenesulfonamide, a selective dopamine D4 antagonist. J Med Chem39:2435-7 (1996) 
 
D(4) dopamine receptor
Name:D(4) dopamine receptor
Type:Enzyme Catalytic Domain
Mol. Mass.:41307.65
Organism:RAT
Description:DOPAMINE D4.4 0 RAT::P30729
Residue:387
BDBM50051563
NameBDBM50051563
Synonyms:4-[4-((R)-2-Isochroman-1-yl-ethyl)-piperazin-1-yl]-benzenesulfonamide U-101387
TypeSmall organic molecule
Emp. Form.C21H27N3O3S
Mol. Mass.401.522
SMILESNS(=O)(=O)c1ccc(cc1)N1CCN(CC[C@H]2OCCc3ccccc23)CC1