Reaction Details
TargetD(3) dopamine receptor
LigandBDBM85067
Substrate/Competitorn/a
Meas. Tech.ChEMBL_62752 (CHEMBL674593)
Ki 240±n/a nM
Citation TenBrink, REBergh, CLDuncan, JNHarris, DWHuff, RMLahti, RALawson, CFLutzke, BSMartin, IJRees, SASchlachter, SKSih, JCSmith, MW (S)-(-)-4-[4-[2-(isochroman-1-yl)ethyl]-piperazin-1-yl] benzenesulfonamide, a selective dopamine D4 antagonist. J Med Chem39:2435-7 (1996) 
 
D(3) dopamine receptor
Name:D(3) dopamine receptor
Type:Protein
Mol. Mass.:49540.58
Organism:Rattus norvegicus (Rat)
Description:P19020
Residue:446
BDBM85067
NameBDBM85067
Synonyms:CAS_170856-41-4 PNU 96415E | PNU-96415E
TypeSmall organic molecule
Emp. Form.C21H25FN2O
Mol. Mass.340.4344
SMILESFc1ccc(cc1)N1CCN(CCC2OCCc3ccccc23)CC1