Reaction Details
TargetXanthine dehydrogenase/oxidase
LigandBDBM50051715
Substrate/Competitorn/a
Meas. Tech.ChEMBL_217080 (CHEMBL823476)
Ki 66800±n/a nM
Citation Biagi, GCostantini, ACostantino, LGiorgi, ILivi, OPecorari, PRinaldi, MScartoni, V Synthesis and biological evaluation of new imidazole, pyrimidine, and purine derivatives and analogs as inhibitors of xanthine oxidase. J Med Chem39:2529-35 (1996) 
 
Xanthine dehydrogenase/oxidase
Name:Xanthine dehydrogenase/oxidase
Type:Enzyme
Mol. Mass.:146441.21
Organism:Homo sapiens (Human)
Description:P47989
Residue:1333
BDBM50051715
NameBDBM50051715
Synonyms:2-Hydroxy-7,8-dihydro-3H,6H-5-thia-1,3,4,8a-tetraaza-cyclopenta[b]naphthalen-9-one | CHEMBL83072
TypeSmall organic molecule
Emp. Form.C8H8N4O2S
Mol. Mass.224.24
SMILESO=c1[nH]c2nc3SCCCn3c(=O)c2[nH]1