Reaction Details
TargetXanthine dehydrogenase/oxidase
LigandBDBM50051722
Substrate/Competitorn/a
Meas. Tech.ChEMBL_217080 (CHEMBL823476)
Ki 890±n/a nM
Citation Biagi, GCostantini, ACostantino, LGiorgi, ILivi, OPecorari, PRinaldi, MScartoni, V Synthesis and biological evaluation of new imidazole, pyrimidine, and purine derivatives and analogs as inhibitors of xanthine oxidase. J Med Chem39:2529-35 (1996) 
 
Xanthine dehydrogenase/oxidase
Name:Xanthine dehydrogenase/oxidase
Type:Enzyme
Mol. Mass.:146441.21
Organism:Homo sapiens (Human)
Description:P47989
Residue:1333
BDBM50051722
NameBDBM50051722
Synonyms:2-Mercapto-7,8-dihydro-3H,6H-9-thia-1,3,4,5a-tetraaza-cyclopenta[a]naphthalen-5-one | CHEMBL315625
TypeSmall organic molecule
Emp. Form.C8H8N4OS2
Mol. Mass.240.305
SMILESO=c1nc2[nH]c(=S)[nH]c2c2SCCCn12