Reaction Details
TargetXanthine dehydrogenase/oxidase
LigandBDBM50051725
Substrate/Competitorn/a
Meas. Tech.ChEMBL_217080 (CHEMBL823476)
Ki 1260±n/a nM
Citation Biagi, GCostantini, ACostantino, LGiorgi, ILivi, OPecorari, PRinaldi, MScartoni, V Synthesis and biological evaluation of new imidazole, pyrimidine, and purine derivatives and analogs as inhibitors of xanthine oxidase. J Med Chem39:2529-35 (1996) 
 
Xanthine dehydrogenase/oxidase
Name:Xanthine dehydrogenase/oxidase
Type:Enzyme
Mol. Mass.:146441.21
Organism:Homo sapiens (Human)
Description:P47989
Residue:1333
BDBM50051725
NameBDBM50051725
Synonyms:2-Hydroxy-7,8-dihydro-3H-thiazolo[2,3-i]purin-5-one | CHEMBL311805
TypeSmall organic molecule
Emp. Form.C7H6N4O2S
Mol. Mass.210.213
SMILESO=c1[nH]c2nc(=O)n3CCSc3c2[nH]1