Reaction Details
TargetXanthine dehydrogenase/oxidase
LigandBDBM50051737
Substrate/Competitorn/a
Meas. Tech.ChEMBL_217080 (CHEMBL823476)
Ki 9.8±n/a nM
Citation Biagi, GCostantini, ACostantino, LGiorgi, ILivi, OPecorari, PRinaldi, MScartoni, V Synthesis and biological evaluation of new imidazole, pyrimidine, and purine derivatives and analogs as inhibitors of xanthine oxidase. J Med Chem39:2529-35 (1996) 
 
Xanthine dehydrogenase/oxidase
Name:Xanthine dehydrogenase/oxidase
Type:Enzyme
Mol. Mass.:146441.21
Organism:Homo sapiens (Human)
Description:P47989
Residue:1333
BDBM50051737
NameBDBM50051737
Synonyms:2-Hexylsulfanyl-1,9-dihydro-purin-6-one | CHEMBL86056
TypeSmall organic molecule
Emp. Form.C11H16N4OS
Mol. Mass.252.336
SMILESCCCCCCSc1nc2nc[nH]c2c(=O)[nH]1