Reaction Details
TargetIntegrin alpha-IIb/beta-3
LigandBDBM50003867
Substrate/Competitorn/a
Meas. Tech.ChEMBL_30110 (CHEMBL642037)
IC50 1.9±n/a nM
Citation Weller, TAlig, LBeresini, MBlackburn, BBunting, SHadváry, PMüller, MHKnopp, DLevet-Trafit, BLipari, MTModi, NBMüller, MRefino, CJSchmitt, MSchönholzer, PWeiss, SSteiner, B Orally active fibrinogen receptor antagonists. 2. Amidoximes as prodrugs of amidines. J Med Chem39:3139-47 (1996) 
 
Integrin alpha-IIb/beta-3
Name:Integrin alpha-IIb/beta-3
Synonyms:Glycoprotein IIb/IIIa
Type:n/a
Mol. Mass.:n/a
Description:ASSAY_ID of EBI is 30109
Components:This complex has 2 components.
Component 1
Name:Integrin beta-3
Type:Protein
Mol. Mass.:87038.91
Organism:Homo sapiens (Human)
Description:P05106
Residue:788
Component 2
Name:Integrin alpha-IIb
Synonyms:CD_antigen=CD41 GPIIb Glycoprotein IIb ITGA2B Integrin alpha-IIb heavy chain Integrin alpha-IIb light chain, form 2 Integrin alpha-V/beta-3 and alpha-IIb/beta 3 | Platelet membrane glycoprotein IIb
Type:Protein
Mol. Mass.:113354.85
Organism:Homo sapiens (Human)
Description:P08514
Residue:1039
BDBM50003867
NameBDBM50003867
Synonyms:CHEMBL65267 {1-[(S)-2-(4-Carbamimidoyl-benzoylamino)-propionyl]-piperidin-4-yloxy}-acetic acid {1-[2-(4-Carbamimidoyl-benzoylamino)-propionyl]-piperidin-4-yloxy}-acetic acid
TypeSmall organic molecule
Emp. Form.C18H24N4O5
Mol. Mass.376.407
SMILESC[C@H](NC(=O)c1ccc(cc1)C(N)=N)C(=O)N1CCC(CC1)OCC(O)=O