Reaction Details
TargetD(1A) dopamine receptor
LigandBDBM50052528
Substrate/Competitorn/a
Meas. Tech.ChEMBL_58515 (CHEMBL672010)
Ki 5004.0±n/a nM
Citation Glase, SAAkunne, HCHeffner, TGJaen, JCMacKenzie, RGMeltzer, LTPugsley, TASmith, SJWise, LD Aryl 1-but-3-ynyl-4-phenyl-1,2,3,6-tetrahydropyridines as potential antipsychotic agents: synthesis and structure-activity relationships. J Med Chem39:3179-87 (1996) 
 
D(1A) dopamine receptor
Name:D(1A) dopamine receptor
Type:Enzyme Catalytic Domain
Mol. Mass.:49429.75
Organism:RAT
Description:P18901
Residue:446
BDBM50052528
NameBDBM50052528
Synonyms:3-[4-(4-Phenyl-3,6-dihydro-2H-pyridin-1-yl)-but-1-ynyl]-pyridine | CHEMBL108463
TypeSmall organic molecule
Emp. Form.C20H20N2
Mol. Mass.288.3862
SMILESC(CN1CCC(=CC1)c1ccccc1)C#Cc1cccnc1