Reaction Details
TargetD(3) dopamine receptor
LigandBDBM50052533
Substrate/Competitorn/a
Meas. Tech.ChEMBL_62124 (CHEMBL673445)
Ki 6.5±n/a nM
Citation Glase, SAAkunne, HCHeffner, TGJaen, JCMacKenzie, RGMeltzer, LTPugsley, TASmith, SJWise, LD Aryl 1-but-3-ynyl-4-phenyl-1,2,3,6-tetrahydropyridines as potential antipsychotic agents: synthesis and structure-activity relationships. J Med Chem39:3179-87 (1996) 
 
D(3) dopamine receptor
Name:D(3) dopamine receptor
Type:n/a
Mol. Mass.:44243.43
Organism:Homo sapiens (Human)
Description:n/a
Residue:400
BDBM50052533
NameBDBM50052533
Synonyms:4-[4-(4-Phenyl-3,6-dihydro-2H-pyridin-1-yl)-but-1-ynyl]-pyridine | CHEMBL110489
TypeSmall organic molecule
Emp. Form.C20H20N2
Mol. Mass.288.3862
SMILESC(CN1CCC(=CC1)c1ccccc1)C#Cc1ccncc1