Reaction Details
TargetPapain
LigandBDBM16510
Substrate/Competitorn/a
Meas. Tech.ChEMBL_152658 (CHEMBL761584)
pH6.8±n/a
Ki 2400±n/a nM
Commentsextracted
Citation Meara, JPRich, DH Mechanistic studies on the inactivation of papain by epoxysuccinyl inhibitors. J Med Chem39:3357-66 (1996) 
 
Papain
Name:Papain
Type:Enzyme
Mol. Mass.:38923.01
Organism:Carica papaya
Description:Papain was purchased from Sigma, Germany.
Residue:345
BDBM16510
NameBDBM16510
Synonyms:(2S,3S)-3-[[(1S)-1-(isoamylcarbamoyl)-3-methyl-butyl]carbamoyl]oxirane-2-carboxylic acid (2S,3S)-3-[[(2S)-4-methyl-1-(3-methylbutylamino)-1-oxopentan-2-yl]carbamoyl]oxirane-2-carboxylic acid (2S,3S)-3-{[(1S)-3-methyl-1-[(3-methylbutyl)carbamoyl]butyl]carbamoyl}oxirane-2-carboxylic acid E-64C MLS000028693 cid_123664 | epoxysuccinyl derivative E64c
TypeSmall organic molecule
Emp. Form.C15H26N2O5
Mol. Mass.314.3773
SMILESCC(C)CCNC(=O)[C@H](CC(C)C)NC(=O)[C@H]1O[C@@H]1C(O)=O