Reaction Details
TargetSerine/threonine-protein kinase D1
LigandBDBM158743
Substrate/Competitorn/a
Meas. Tech.ChEMBL_1808275 (CHEMBL4307634)
Ki<0.200000±n/a nM
Citation Feng, JALee, PAlaoui, MHBarrett, KCastanedo, GGodemann, RMcEwan, PWang, XWu, PZhang, YHarris, SFStaben, ST Structure Based Design of Potent Selective Inhibitors of Protein Kinase D1 (PKD1). ACS Med Chem Lett10:1260-1265 (2019) 
 
Serine/threonine-protein kinase D1
Name:Serine/threonine-protein kinase D1
Type:Serine/threonine-protein kinase
Mol. Mass.:101705.07
Organism:Homo sapiens (Human)
Description:gi_115529463
Residue:912
BDBM158743
NameBDBM158743
Synonyms:US9034866, 218
TypeSmall organic molecule
Emp. Form.C25H23FN4O3
Mol. Mass.446.4735
SMILESCc1cc(no1)[C@](C)(O)C#Cc1cc2-c3nc(C(N)=O)c(C4CC4)n3C3CC(C3)c2cc1F