Reaction Details
Target5-hydroxytryptamine receptor 1A
LigandBDBM50052859
Substrate/Competitorn/a
Meas. Tech.ChEMBL_1175 (CHEMBL615941)
Ki 3.2±n/a nM
Citation Hedberg, MHJansen, JMNordvall, GHjorth, SUnelius, LJohansson, AM 10-substituted 11-oxygenated (R)-aporphines: synthesis, pharmacology, and modeling of 5-HT1A receptor interactions. J Med Chem39:3491-502 (1996) 
 
5-hydroxytryptamine receptor 1A
Name:5-hydroxytryptamine receptor 1A
Type:G Protein-Coupled Receptor (GPCR)
Mol. Mass.:46445.29
Organism:Rattus norvegicus (rat)
Description:Binding assays were performed using rat hippocampal membranes.
Residue:422
BDBM50052859
NameBDBM50052859
Synonyms:(R)-10-methyl-5,6,6a,7-tetrahydro-4H-dibenzo[de,g]quinolin-11-ol | CHEMBL116367
TypeSmall organic molecule
Emp. Form.C17H17NO
Mol. Mass.251.323
SMILESCc1ccc2C[C@H]3NCCc4cccc(c34)-c2c1O