Reaction Details
Target5-hydroxytryptamine receptor 1A
LigandBDBM50052871
Substrate/Competitorn/a
Meas. Tech.ChEMBL_1173 (CHEMBL615939)
Ki 8.3±n/a nM
Citation Hedberg, MHLinnanen, TJansen, JMNordvall, GHjorth, SUnelius, LJohansson, AM 11-substituted (R)-aporphines: synthesis, pharmacology, and modeling of D2A and 5-HT1A receptor interactions. J Med Chem39:3503-13 (1996) 
 
5-hydroxytryptamine receptor 1A
Name:5-hydroxytryptamine receptor 1A
Type:G Protein-Coupled Receptor (GPCR)
Mol. Mass.:46445.29
Organism:Rattus norvegicus (rat)
Description:Binding assays were performed using rat hippocampal membranes.
Residue:422
BDBM50052871
NameBDBM50052871
Synonyms:(R)-11-Methoxy-5,6,6a,7-tetrahydro-4H-dibenzo[de,g]quinoline | CHEMBL119132
TypeSmall organic molecule
Emp. Form.C17H17NO
Mol. Mass.251.323
SMILESCOc1cccc2C[C@H]3NCCc4cccc(c34)-c12