Reaction Details
Target5-hydroxytryptamine receptor 1A
LigandBDBM50052873
Substrate/Competitorn/a
Meas. Tech.ChEMBL_1173 (CHEMBL615939)
Ki 5.7±n/a nM
Citation Hedberg, MHLinnanen, TJansen, JMNordvall, GHjorth, SUnelius, LJohansson, AM 11-substituted (R)-aporphines: synthesis, pharmacology, and modeling of D2A and 5-HT1A receptor interactions. J Med Chem39:3503-13 (1996) 
 
5-hydroxytryptamine receptor 1A
Name:5-hydroxytryptamine receptor 1A
Type:G Protein-Coupled Receptor (GPCR)
Mol. Mass.:46445.29
Organism:Rattus norvegicus (rat)
Description:Binding assays were performed using rat hippocampal membranes.
Residue:422
BDBM50052873
NameBDBM50052873
Synonyms:(R)-5,6,6a,7-tetrahydro-4H-dibenzo[de,g]quinolin-11-ol | CHEMBL332332
TypeSmall organic molecule
Emp. Form.C16H15NO
Mol. Mass.237.2964
SMILESOc1cccc2C[C@H]3NCCc4cccc(c34)-c12