Reaction Details
Target5-hydroxytryptamine receptor 1A
LigandBDBM50052879
Substrate/Competitorn/a
Meas. Tech.ChEMBL_1173 (CHEMBL615939)
Ki 57.1±n/a nM
Citation Hedberg, MHLinnanen, TJansen, JMNordvall, GHjorth, SUnelius, LJohansson, AM 11-substituted (R)-aporphines: synthesis, pharmacology, and modeling of D2A and 5-HT1A receptor interactions. J Med Chem39:3503-13 (1996) 
 
5-hydroxytryptamine receptor 1A
Name:5-hydroxytryptamine receptor 1A
Type:G Protein-Coupled Receptor (GPCR)
Mol. Mass.:46445.29
Organism:Rattus norvegicus (rat)
Description:Binding assays were performed using rat hippocampal membranes.
Residue:422
BDBM50052879
NameBDBM50052879
Synonyms:1-((R)-6-Methyl-5,6,6a,7-tetrahydro-4H-dibenzo[de,g]quinolin-11-yl)-ethanone | CHEMBL333134
TypeSmall organic molecule
Emp. Form.C19H19NO
Mol. Mass.277.3603
SMILESCN1CCc2cccc-3c2[C@H]1Cc1cccc(C(C)=O)c-31