Reaction Details
TargetRetinoic acid receptor RXR-alpha
LigandBDBM50052958
Substrate/Competitorn/a
Meas. Tech.ChEMBL_196781 (CHEMBL799566)
EC50 280±n/a nM
Citation Beard, RLColon, DFSong, TKDavies, PJKochhar, DMChandraratna, RA Synthesis and structure-activity relationships of retinoid X receptor selective diaryl sulfide analogs of retinoic acid. J Med Chem39:3556-63 (1996) 
 
Retinoic acid receptor RXR-alpha
Name:Retinoic acid receptor RXR-alpha
Type:PROTEIN
Mol. Mass.:50820.38
Organism:Homo sapiens (Human)
Description:ChEMBL_1456363
Residue:462
BDBM50052958
NameBDBM50052958
Synonyms:4-(3,5,5,8,8-Pentamethyl-5,6,7,8-tetrahydro-naphthalen-2-ylsulfanyl)-benzoic acid | CHEMBL118693
TypeSmall organic molecule
Emp. Form.C22H26O2S
Mol. Mass.354.506
SMILESCc1cc2c(cc1Sc1ccc(cc1)C(O)=O)C(C)(C)CCC2(C)C